{"text_format":"1","workbook":"xlsx","n_sheets":4,"sheets":["Directions","BSRDetail","01","Objects"],"not_rendered":{"charts":0,"images":0,"macros":1,"external_links":0,"defined_names":3,"comments":1,"pivot_tables":0},"unopened":[],"bounds":{"document_bytes":16777216,"sheet_cells":100000,"rows_first":2000,"rows_last":500,"rows_between":2000,"halvings":0,"cell_chars":16384,"cell_head_chars":4096},"cells_cut":0,"cells_raw":0,"read":"whole","date_system":"1900"}

{"sheet":"Directions","index":0,"n_rows":27,"n_cols":4,"rows_kept":27,"cut":false,"hidden":false,"merged":[[26,0,33,1],[0,0,0,3],[1,0,1,3],[25,0,25,1]]}
["State of Nevada Salary Projections"]
["Version 2012.04"]
[]
["Instructions",null,null,"Changes from version 2011.01 include:"]
["Enable Macros when this file is opened.",null,null,"Corrected formula for total forecast in [01]A41 that was double counting information"]
["Select the following link:",null,null,"Corrected error in FTE count calculation in Group Insur GL 5500 when no data entered"]
{"$rows_left_out":22}
{"sheet":"BSRDetail","index":1,"n_rows":60,"n_cols":11,"rows_kept":60,"cut":false,"hidden":false,"merged":[]}
["Fiscal Year","Budget Acct","Category","Doc Number","Date","Object","Object Desciption","Amount","Acct Type","Vendor Name","Line Description"]
[]
[2017,2895,1,"JV 332 CNT6560077R","2016-07-13",5500,"GROUP INSURANCE",1398.5,22]
[2017,2895,1,"JV 332 CNT6590883","2016-07-15",5100,"SALARIES",457.84,22]
[2017,2895,1,"JV 332 CNT6590883","2016-07-15",5301,0,66.39,22]
[2017,2895,1,"JV 332 CNT6590883","2016-07-15",5200,"WORKERS COMPENSATION",3.92,22]
{"$rows_left_out":55}
{"sheet":"01","index":2,"n_rows":53,"n_cols":101,"rows_kept":53,"cut":false,"hidden":false,"merged":[[33,0,37,0]]}
[2017,2895,"Days in FY",5100,5610,5620,5630,5640,5650,"Total Salaries and Leaves",null,null,null,5170,5190,5810,5820,5830,5870,5880,5881,5910,5940,5980,"Total Extra Pays",null,null,"Total Forecast Pay",5200,null,null,5300,null,null,5400,null,5500,null,null,null,5700,null,5750,null,null,5800,null,null,5840,null,null,5860,null,null,5960,5970,null,null,5660,5120,null,5301,null,7112,null,7046]
["Friday Holidays","Paydays",null,{"$f":"VLOOKUP(D1,Objects!$A$2:$B$1605,2,0)","v":"SALARIES"},{"$f":"VLOOKUP(E1,Objects!$A$2:$B$1605,2,0)","v":"SICK LEAVES"},{"$f":"VLOOKUP(F1,Objects!$A$2:$B$1605,2,0)","v":"ANNUAL LEAVES"},{"$f":"VLOOKUP(G1,Objects!$A$2:$B$1605,2,0)","v":"HOLIDAY LEAVES"},{"$f":"VLOOKUP(H1,Objects!$A$2:$B$1605,2,0)","v":"COMP TIME LEAVES"},{"$f":"VLOOKUP(I1,Objects!$A$2:$B$1605,2,0)","v":"OTHER LEAVES"},null,null,null,null,{"$f":"VLOOKUP(N1,Objects!$A$2:$B$1605,2,0)","v":"SEASONAL"},{"$f":"VLOOKUP(O1,Objects!$A$2:$B$1605,2,0)","v":"SUPPLEMENTAL MILITARY PAY"},{"$f":"VLOOKUP(P1,Objects!$A$2:$B$1605,2,0)","v":"OVERTIME PAY"},{"$f":"VLOOKUP(Q1,Objects!$A$2:$B$1605,2,0)","v":"HOLIDAY PAY"},{"$f":"VLOOKUP(R1,Objects!$A$2:$B$1605,2,0)","v":"COMP TIME PAYOFF"},{"$f":"VLOOKUP(S1,Objects!$A$2:$B$1605,2,0)","v":"OVERTIME SEASONAL"},{"$f":"VLOOKUP(T1,Objects!$A$2:$B$1605,2,0)","v":"SHIFT DIFFERENTIAL PAY"},{"$f":"VLOOKUP(U1,Objects!$A$2:$B$1605,2,0)","v":"REMOTE AREA DIFFERENTIAL PAY"},{"$f":"VLOOKUP(V1,Objects!$A$2:$B$1605,2,0)","v":"STANDBY PAY"},{"$f":"VLOOKUP(W1,Objects!$A$2:$B$1605,2,0)","v":"DANGEROUS DUTY PAY"},{"$f":"VLOOKUP(X1,Objects!$A$2:$B$1605,2,0)","v":"CALL BACK PAY"},null,null,null,null,{"$f":"VLOOKUP(AC1,Objects!$A$2:$B$1605,2,0)","v":"WORKERS COMPENSATION"},null,null,{"$f":"VLOOKUP(AF1,Objects!$A$2:$B$1605,2,0)","v":"RETIREMENT"},null,null,{"$f":"VLOOKUP(AI1,Objects!$A$2:$B$1605,2,0)","v":"PERSONNEL ASSESSMENT"},null,{"$f":"VLOOKUP(AK1,Objects!$A$2:$B$1605,2,0)","v":"GROUP INSURANCE"},null,null,null,{"$f":"VLOOKUP(AO1,Objects!$A$2:$B$1605,2,0)","v":"PAYROLL ASSESSMENT"},null,{"$f":"VLOOKUP(AQ1,Objects!$A$2:$B$1605,2,0)","v":"RETIRED EMPLOYEES GROUP INSURA"},null,null,{"$f":"VLOOKUP(AT1,Objects!$A$2:$B$1605,2,0)","v":"UNEMPLOYMENT COMPENSATION"},null,null,{"$f":"VLOOKUP(AW1,Objects!$A$2:$B$1605,2,0)","v":"MEDICARE"},null,null,{"$f":"VLOOKUP(AZ1,Objects!$A$2:$B$1605,2,0)","v":"BOARD AND COMMISSION PAY"},null,null,{"$f":"VLOOKUP(BC1,Objects!$A$2:$B$1605,2,0)","v":"TERMINAL SICK LEAVE PAY"},{"$f":"VLOOKUP(BD1,Objects!$A$2:$B$1605,2,0)","v":"TERMINAL ANNUAL LEAVE PAY"},null,null,{"$f":"VLOOKUP(BG1,Objects!$A$2:$B$1605,2,0)","v":"FURLOUGH LEAVE"},{"$f":"VLOOKUP(BH1,Objects!$A$2:$B$1605,2,0)","v":"FURLOUGH ADJUSTMENTS"},"Total Furlough Adjustments",{"$f":"VLOOKUP(BJ1,BSRDetail!$F$2:$G$61,2,0)","v":0},null,{"$f":"VLOOKUP(BL1,BSRDetail!$F$2:$G$61,2,0)","v":{"$error":"#N/A"}},null,{"$f":"VLOOKUP(BN1,BSRDetail!$F$2:$G$61,2,0)","v":{"$error":"#N/A"}},null,{"$f":"VLOOKUP(BP1,BSRDetail!$F$2:$G$61,2,0)","v":{"$error":"#N/A"}},null,{"$f":"VLOOKUP(BR1,BSRDetail!$F$2:$G$61,2,0)","v":{"$error":"#N/A"}},null,{"$f":"VLOOKUP(BT1,BSRDetail!$F$2:$G$61,2,0)","v":{"$error":"#N/A"}},null,{"$f":"VLOOKUP(BV1,BSRDetail!$F$2:$G$61,2,0)","v":{"$error":"#N/A"}},null,{"$f":"VLOOKUP(BX1,BSRDetail!$F$2:$G$61,2,0)","v":{"$error":"#N/A"}},null,{"$f":"VLOOKUP(BZ1,BSRDetail!$F$2:$G$61,2,0)","v":{"$error":"#N/A"}},null,{"$f":"VLOOKUP(CB1,BSRDetail!$F$2:$G$61,2,0)","v":{"$error":"#N/A"}},null,{"$f":"VLOOKUP(CD1,BSRDetail!$F$2:$G$61,2,0)","v":{"$error":"#N/A"}},null,{"$f":"VLOOKUP(CF1,BSRDetail!$F$2:$G$61,2,0)","v":{"$error":"#N/A"}},null,{"$f":"VLOOKUP(CH1,BSRDetail!$F$2:$G$61,2,0)","v":{"$error":"#N/A"}},null,{"$f":"VLOOKUP(CJ1,BSRDetail!$F$2:$G$61,2,0)","v":{"$error":"#N/A"}},null,{"$f":"VLOOKUP(CL1,BSRDetail!$F$2:$G$61,2,0)","v":{"$error":"#N/A"}},null,{"$f":"VLOOKUP(CN1,BSRDetail!$F$2:$G$61,2,0)","v":{"$error":"#N/A"}},null,{"$f":"VLOOKUP(CP1,BSRDetail!$F$2:$G$61,2,0)","v":{"$error":"#N/A"}},null,{"$f":"VLOOKUP(CR1,BSRDetail!$F$2:$G$61,2,0)","v":{"$error":"#N/A"}},null,{"$f":"VLOOKUP(CT1,BSRDetail!$F$2:$G$61,2,0)","v":{"$error":"#N/A"}},null,{"$f":"VLOOKUP(CV1,BSRDetail!$F$2:$G$61,2,0)","v":{"$error":"#N/A"}}]
[null,null,null,null,null,null,null,null,null,null,null,null,null,null,null,null,null,null,null,null,null,null,null,null,null,null,null,null,{"$f":"TEXT($B$6,\"m/d/yy\")&\" - \"&TEXT(DATE(YEAR($B$6),12,31),\"m/d/yy\")","v":"7/1/16 - 12/31/16"},2.8799999999999999E-2,null,null,null,null,null,null,"AEGIS Rate:",701.73,null,null,null,null,null,null,null,{"$f":"TEXT($B$6,\"m/d/yy\")&\" - \"&TEXT(DATE(YEAR($B$6),12,31),\"m/d/yy\")","v":"7/1/16 - 12/31/16"},1.2999999999999999E-3]
[null,null,null,null,null,null,null,null,null,null,null,null,null,null,null,null,null,null,null,null,null,null,null,null,null,null,null,null,{"$f":"TEXT(DATE(YEAR($B$34),1,1),\"m/d/yy\")&\" - \"&TEXT(DATE(YEAR($B$7),6,30),\"m/d/yy\")","v":"1/1/17 - 6/30/16"},2.3699999999999999E-2,null,null,null,null,null,null,null,null,"Adjusted",null,null,null,null,null,null,{"$f":"TEXT(DATE(YEAR($B$34),1,1),\"m/d/yy\")&\" - \"&TEXT(DATE(YEAR($B$7),6,30),\"m/d/yy\")","v":"1/1/17 - 6/30/16"},6.9999999999999999E-4,null,null,null,null,null,null,0]
[null,null,null,"Expended","Expended","Expended","Expended","Expended","Expended","Expended","Forecast","Adjustments","Forecast","Expended","Expended","Expended","Expended","Expended","Expended","Expended","Expended","Expended","Expended","Expended","Expended","Adjustments","Forecast","Forecast","Expended","Rate","Forecast","Expended","Rate","Forecast","Expended","Forecast","Expended","FTEs","FTEs","Forecast","Expended","Forecast","Expended","Rate","Forecast","Expended","Rate","Forecast","Expended","Rate","Forecast","Expended","Adjustments","Forecast","Expended","Expended","Adjustments","Forecast","Expended","Expended","Total","Expended","Forecast","Expended","Forecast","Expended","Forecast","Expended","Forecast","Expended","Forecast","Expended","Forecast","Expended","Forecast","Expended","Forecast","Expended","Forecast","Expended","Forecast","Expended","Forecast","Expended","Forecast","Expended","Forecast","Expended","Forecast","Expended","Forecast","Expended","Forecast","Expended","Forecast","Expended","Forecast","Expended","Forecast","Expended","Forecast"]
[null,{"$f":"DATE(A1-1,7,1)","v":"2016-07-01"},null,{"$f":"SUM(BSRDetail!$H$2:$H$61*(BSRDetail!$A$2:$A$61=$A$1)*(BSRDetail!$F$2:$F$61=D$1)*(BSRDetail!$B$2:$B$61=$B$1)*(BSRDetail!$E$2:$E$61>=$B6)*(BSRDetail!$E$2:$E$61<$B7))","v":457.84},{"$f":"SUM(BSRDetail!$H$2:$H$61*(BSRDetail!$A$2:$A$61=$A$1)*(BSRDetail!$F$2:$F$61=E$1)*(BSRDetail!$B$2:$B$61=$B$1)*(BSRDetail!$E$2:$E$61>=$B6)*(BSRDetail!$E$2:$E$61<$B7))","v":0},{"$f":"SUM(BSRDetail!$H$2:$H$61*(BSRDetail!$A$2:$A$61=$A$1)*(BSRDetail!$F$2:$F$61=F$1)*(BSRDetail!$B$2:$B$61=$B$1)*(BSRDetail!$E$2:$E$61>=$B6)*(BSRDetail!$E$2:$E$61<$B7))","v":0},{"$f":"SUM(BSRDetail!$H$2:$H$61*(BSRDetail!$A$2:$A$61=$A$1)*(BSRDetail!$F$2:$F$61=G$1)*(BSRDetail!$B$2:$B$61=$B$1)*(BSRDetail!$E$2:$E$61>=$B6)*(BSRDetail!$E$2:$E$61<$B7))","v":0},{"$f":"SUM(BSRDetail!$H$2:$H$61*(BSRDetail!$A$2:$A$61=$A$1)*(BSRDetail!$F$2:$F$61=H$1)*(BSRDetail!$B$2:$B$61=$B$1)*(BSRDetail!$E$2:$E$61>=$B6)*(BSRDetail!$E$2:$E$61<$B7))","v":0},{"$f":"SUM(BSRDetail!$H$2:$H$61*(BSRDetail!$A$2:$A$61=$A$1)*(BSRDetail!$F$2:$F$61=I$1)*(BSRDetail!$B$2:$B$61=$B$1)*(BSRDetail!$E$2:$E$61>=$B6)*(BSRDetail!$E$2:$E$61<$B7))","v":0},{"$f":"SUM(D6:I6)","v":457.84},{"$f":"J6","v":457.84},null,{"$f":"K6+L6","v":457.84},{"$f":"SUM(BSRDetail!$H$2:$H$61*(BSRDetail!$A$2:$A$61=$A$1)*(BSRDetail!$F$2:$F$61=N$1)*(BSRDetail!$B$2:$B$61=$B$1)*(BSRDetail!$E$2:$E$61>=$B6)*(BSRDetail!$E$2:$E$61<$B7))","v":0},{"$f":"SUM(BSRDetail!$H$2:$H$61*(BSRDetail!$A$2:$A$61=$A$1)*(BSRDetail!$F$2:$F$61=O$1)*(BSRDetail!$B$2:$B$61=$B$1)*(BSRDetail!$E$2:$E$61>=$B6)*(BSRDetail!$E$2:$E$61<$B7))","v":0},{"$f":"SUM(BSRDetail!$H$2:$H$61*(BSRDetail!$A$2:$A$61=$A$1)*(BSRDetail!$F$2:$F$61=P$1)*(BSRDetail!$B$2:$B$61=$B$1)*(BSRDetail!$E$2:$E$61>=$B6)*(BSRDetail!$E$2:$E$61<$B7))","v":0},{"$f":"SUM(BSRDetail!$H$2:$H$61*(BSRDetail!$A$2:$A$61=$A$1)*(BSRDetail!$F$2:$F$61=Q$1)*(BSRDetail!$B$2:$B$61=$B$1)*(BSRDetail!$E$2:$E$61>=$B6)*(BSRDetail!$E$2:$E$61<$B7))","v":0},{"$f":"SUM(BSRDetail!$H$2:$H$61*(BSRDetail!$A$2:$A$61=$A$1)*(BSRDetail!$F$2:$F$61=R$1)*(BSRDetail!$B$2:$B$61=$B$1)*(BSRDetail!$E$2:$E$61>=$B6)*(BSRDetail!$E$2:$E$61<$B7))","v":0},{"$f":"SUM(BSRDetail!$H$2:$H$61*(BSRDetail!$A$2:$A$61=$A$1)*(BSRDetail!$F$2:$F$61=S$1)*(BSRDetail!$B$2:$B$61=$B$1)*(BSRDetail!$E$2:$E$61>=$B6)*(BSRDetail!$E$2:$E$61<$B7))","v":0},{"$f":"SUM(BSRDetail!$H$2:$H$61*(BSRDetail!$A$2:$A$61=$A$1)*(BSRDetail!$F$2:$F$61=T$1)*(BSRDetail!$B$2:$B$61=$B$1)*(BSRDetail!$E$2:$E$61>=$B6)*(BSRDetail!$E$2:$E$61<$B7))","v":0},{"$f":"SUM(BSRDetail!$H$2:$H$61*(BSRDetail!$A$2:$A$61=$A$1)*(BSRDetail!$F$2:$F$61=U$1)*(BSRDetail!$B$2:$B$61=$B$1)*(BSRDetail!$E$2:$E$61>=$B6)*(BSRDetail!$E$2:$E$61<$B7))","v":0},{"$f":"SUM(BSRDetail!$H$2:$H$61*(BSRDetail!$A$2:$A$61=$A$1)*(BSRDetail!$F$2:$F$61=V$1)*(BSRDetail!$B$2:$B$61=$B$1)*(BSRDetail!$E$2:$E$61>=$B6)*(BSRDetail!$E$2:$E$61<$B7))","v":0},{"$f":"SUM(BSRDetail!$H$2:$H$61*(BSRDetail!$A$2:$A$61=$A$1)*(BSRDetail!$F$2:$F$61=W$1)*(BSRDetail!$B$2:$B$61=$B$1)*(BSRDetail!$E$2:$E$61>=$B6)*(BSRDetail!$E$2:$E$61<$B7))","v":0},{"$f":"SUM(BSRDetail!$H$2:$H$61*(BSRDetail!$A$2:$A$61=$A$1)*(BSRDetail!$F$2:$F$61=X$1)*(BSRDetail!$B$2:$B$61=$B$1)*(BSRDetail!$E$2:$E$61>=$B6)*(BSRDetail!$E$2:$E$61<$B7))","v":0},{"$f":"SUM(N6:X6)","v":0},null,null,null,{"$f":"SUM(BSRDetail!$H$2:$H$61*(BSRDetail!$A$2:$A$61=$A$1)*(BSRDetail!$F$2:$F$61=AC$1)*(BSRDetail!$B$2:$B$61=$B$1)*(BSRDetail!$E$2:$E$61>=$B6)*(BSRDetail!$E$2:$E$61<$B7))","v":3.92},null,{"$f":"IF($D6=0,AB6*AD6,AC6)","v":3.92},{"$f":"SUM(BSRDetail!$H$2:$H$61*(BSRDetail!$A$2:$A$61=$A$1)*(BSRDetail!$F$2:$F$61=AF$1)*(BSRDetail!$B$2:$B$61=$B$1)*(BSRDetail!$E$2:$E$61>=$B6)*(BSRDetail!$E$2:$E$61<$B7))","v":0},null,null,{"$f":"SUM(BSRDetail!$H$2:$H$61*(BSRDetail!$A$2:$A$61=$A$1)*(BSRDetail!$F$2:$F$61=AI$1)*(BSRDetail!$B$2:$B$61=$B$1)*(BSRDetail!$E$2:$E$61>=$B6)*(BSRDetail!$E$2:$E$61<$B7))","v":0},{"$f":"AI6","v":0},{"$f":"SUM(BSRDetail!$H$2:$H$61*(BSRDetail!$A$2:$A$61=$A$1)*(BSRDetail!$F$2:$F$61=AK$1)*(BSRDetail!$B$2:$B$61=$B$1)*(BSRDetail!$E$2:$E$61>=$B6)*(BSRDetail!$E$2:$E$61<$B7))","v":1398.5},null,0,{"$f":"IF(AK6=0,IF(AL6>0,IF(AM6>0,AM6,AL6)*$AL$3,0),AK6)","v":1398.5},{"$f":"SUM(BSRDetail!$H$2:$H$61*(BSRDetail!$A$2:$A$61=$A$1)*(BSRDetail!$F$2:$F$61=AO$1)*(BSRDetail!$B$2:$B$61=$B$1)*(BSRDetail!$E$2:$E$61>=$B6)*(BSRDetail!$E$2:$E$61<$B7))","v":0},{"$f":"AO6","v":0},{"$f":"SUM(BSRDetail!$H$2:$H$61*(BSRDetail!$A$2:$A$61=$A$1)*(BSRDetail!$F$2:$F$61=AQ$1)*(BSRDetail!$B$2:$B$61=$B$1)*(BSRDetail!$E$2:$E$61>=$B6)*(BSRDetail!$E$2:$E$61<$B7))","v":9.75},null,{"$f":"IF($D6=0,M6*AR6,AQ6)","v":9.75},{"$f":"SUM(BSRDetail!$H$2:$H$61*(BSRDetail!$A$2:$A$61=$A$1)*(BSRDetail!$F$2:$F$61=AT$1)*(BSRDetail!$B$2:$B$61=$B$1)*(BSRDetail!$E$2:$E$61>=$B6)*(BSRDetail!$E$2:$E$61<$B7))","v":0.32},{"$f":"IF($B6-14<DATE(YEAR($B$6)+1,1,1),AU$3,AU$4)","v":1.2999999999999999E-3},{"$f":"IF($D6=0,AB6*AU6,AT6)","v":0.32},{"$f":"SUM(BSRDetail!$H$2:$H$61*(BSRDetail!$A$2:$A$61=$A$1)*(BSRDetail!$F$2:$F$61=AW$1)*(BSRDetail!$B$2:$B$61=$B$1)*(BSRDetail!$E$2:$E$61>=$B6)*(BSRDetail!$E$2:$E$61<$B7))","v":6.64},null,{"$f":"IF($D6=0,AB6*AX6,AW6)","v":6.64},{"$f":"SUM(BSRDetail!$H$2:$H$61*(BSRDetail!$A$2:$A$61=$A$1)*(BSRDetail!$F$2:$F$61=AZ$1)*(BSRDetail!$B$2:$B$61=$B$1)*(BSRDetail!$E$2:$E$61>=$B6)*(BSRDetail!$E$2:$E$61<$B7))","v":0},null,null,{"$f":"SUM(BSRDetail!$H$2:$H$61*(BSRDetail!$A$2:$A$61=$A$1)*(BSRDetail!$F$2:$F$61=BC$1)*(BSRDetail!$B$2:$B$61=$B$1)*(BSRDetail!$E$2:$E$61>=$B6)*(BSRDetail!$E$2:$E$61<$B7))","v":0},{"$f":"SUM(BSRDetail!$H$2:$H$61*(BSRDetail!$A$2:$A$61=$A$1)*(BSRDetail!$F$2:$F$61=BD$1)*(BSRDetail!$B$2:$B$61=$B$1)*(BSRDetail!$E$2:$E$61>=$B6)*(BSRDetail!$E$2:$E$61<$B7))","v":0},null,{"$f":"SUM(BC6:BE6)","v":0},{"$f":"SUM(BSRDetail!$H$2:$H$61*(BSRDetail!$A$2:$A$61=$A$1)*(BSRDetail!$F$2:$F$61=BG$1)*(BSRDetail!$B$2:$B$61=$B$1)*(BSRDetail!$E$2:$E$61>=$B6)*(BSRDetail!$E$2:$E$61<$B7))","v":0},{"$f":"SUM(BSRDetail!$H$2:$H$61*(BSRDetail!$A$2:$A$61=$A$1)*(BSRDetail!$F$2:$F$61=BH$1)*(BSRDetail!$B$2:$B$61=$B$1)*(BSRDetail!$E$2:$E$61>=$B6)*(BSRDetail!$E$2:$E$61<$B7))","v":0},{"$f":"SUM(BG6:BH6)","v":0},{"$f":"SUM(BSRDetail!$H$2:$H$61*(BSRDetail!$A$2:$A$61=$A$1)*(BSRDetail!$F$2:$F$61=BJ$1)*(BSRDetail!$B$2:$B$61=$B$1)*(BSRDetail!$E$2:$E$61>=$B6)*(BSRDetail!$E$2:$E$61<$B7))","v":66.39},{"$f":"BJ6","v":66.39},{"$f":"SUM(BSRDetail!$H$2:$H$61*(BSRDetail!$A$2:$A$61=$A$1)*(BSRDetail!$F$2:$F$61=BL$1)*(BSRDetail!$B$2:$B$61=$B$1)*(BSRDetail!$E$2:$E$61>=$B6)*(BSRDetail!$E$2:$E$61<$B7))","v":0},{"$f":"BL6","v":0},{"$f":"SUM(BSRDetail!$H$2:$H$61*(BSRDetail!$A$2:$A$61=$A$1)*(BSRDetail!$F$2:$F$61=BN$1)*(BSRDetail!$B$2:$B$61=$B$1)*(BSRDetail!$E$2:$E$61>=$B6)*(BSRDetail!$E$2:$E$61<$B7))","v":0},{"$f":"BN6","v":0},{"$f":"SUM(BSRDetail!$H$2:$H$61*(BSRDetail!$A$2:$A$61=$A$1)*(BSRDetail!$F$2:$F$61=BP$1)*(BSRDetail!$B$2:$B$61=$B$1)*(BSRDetail!$E$2:$E$61>=$B6)*(BSRDetail!$E$2:$E$61<$B7))","v":0},{"$f":"BP6","v":0},{"$f":"SUM(BSRDetail!$H$2:$H$61*(BSRDetail!$A$2:$A$61=$A$1)*(BSRDetail!$F$2:$F$61=BR$1)*(BSRDetail!$B$2:$B$61=$B$1)*(BSRDetail!$E$2:$E$61>=$B6)*(BSRDetail!$E$2:$E$61<$B7))","v":0},{"$f":"BR6","v":0},{"$f":"SUM(BSRDetail!$H$2:$H$61*(BSRDetail!$A$2:$A$61=$A$1)*(BSRDetail!$F$2:$F$61=BT$1)*(BSRDetail!$B$2:$B$61=$B$1)*(BSRDetail!$E$2:$E$61>=$B6)*(BSRDetail!$E$2:$E$61<$B7))","v":0},{"$f":"BT6","v":0},{"$f":"SUM(BSRDetail!$H$2:$H$61*(BSRDetail!$A$2:$A$61=$A$1)*(BSRDetail!$F$2:$F$61=BV$1)*(BSRDetail!$B$2:$B$61=$B$1)*(BSRDetail!$E$2:$E$61>=$B6)*(BSRDetail!$E$2:$E$61<$B7))","v":0},{"$f":"BV6","v":0},{"$f":"SUM(BSRDetail!$H$2:$H$61*(BSRDetail!$A$2:$A$61=$A$1)*(BSRDetail!$F$2:$F$61=BX$1)*(BSRDetail!$B$2:$B$61=$B$1)*(BSRDetail!$E$2:$E$61>=$B6)*(BSRDetail!$E$2:$E$61<$B7))","v":0},{"$f":"BX6","v":0},{"$f":"SUM(BSRDetail!$H$2:$H$61*(BSRDetail!$A$2:$A$61=$A$1)*(BSRDetail!$F$2:$F$61=BZ$1)*(BSRDetail!$B$2:$B$61=$B$1)*(BSRDetail!$E$2:$E$61>=$B6)*(BSRDetail!$E$2:$E$61<$B7))","v":0},{"$f":"BZ6","v":0},{"$f":"SUM(BSRDetail!$H$2:$H$61*(BSRDetail!$A$2:$A$61=$A$1)*(BSRDetail!$F$2:$F$61=CB$1)*(BSRDetail!$B$2:$B$61=$B$1)*(BSRDetail!$E$2:$E$61>=$B6)*(BSRDetail!$E$2:$E$61<$B7))","v":0},{"$f":"CB6","v":0},{"$f":"SUM(BSRDetail!$H$2:$H$61*(BSRDetail!$A$2:$A$61=$A$1)*(BSRDetail!$F$2:$F$61=CD$1)*(BSRDetail!$B$2:$B$61=$B$1)*(BSRDetail!$E$2:$E$61>=$B6)*(BSRDetail!$E$2:$E$61<$B7))","v":0},{"$f":"CD6","v":0},{"$f":"SUM(BSRDetail!$H$2:$H$61*(BSRDetail!$A$2:$A$61=$A$1)*(BSRDetail!$F$2:$F$61=CF$1)*(BSRDetail!$B$2:$B$61=$B$1)*(BSRDetail!$E$2:$E$61>=$B6)*(BSRDetail!$E$2:$E$61<$B7))","v":0},{"$f":"CF6","v":0},{"$f":"SUM(BSRDetail!$H$2:$H$61*(BSRDetail!$A$2:$A$61=$A$1)*(BSRDetail!$F$2:$F$61=CH$1)*(BSRDetail!$B$2:$B$61=$B$1)*(BSRDetail!$E$2:$E$61>=$B6)*(BSRDetail!$E$2:$E$61<$B7))","v":0},{"$f":"CH6","v":0},{"$f":"SUM(BSRDetail!$H$2:$H$61*(BSRDetail!$A$2:$A$61=$A$1)*(BSRDetail!$F$2:$F$61=CJ$1)*(BSRDetail!$B$2:$B$61=$B$1)*(BSRDetail!$E$2:$E$61>=$B6)*(BSRDetail!$E$2:$E$61<$B7))","v":0},{"$f":"CJ6","v":0},{"$f":"SUM(BSRDetail!$H$2:$H$61*(BSRDetail!$A$2:$A$61=$A$1)*(BSRDetail!$F$2:$F$61=CL$1)*(BSRDetail!$B$2:$B$61=$B$1)*(BSRDetail!$E$2:$E$61>=$B6)*(BSRDetail!$E$2:$E$61<$B7))","v":0},{"$f":"CL6","v":0},{"$f":"SUM(BSRDetail!$H$2:$H$61*(BSRDetail!$A$2:$A$61=$A$1)*(BSRDetail!$F$2:$F$61=CN$1)*(BSRDetail!$B$2:$B$61=$B$1)*(BSRDetail!$E$2:$E$61>=$B6)*(BSRDetail!$E$2:$E$61<$B7))","v":0},{"$f":"CN6","v":0},{"$f":"SUM(BSRDetail!$H$2:$H$61*(BSRDetail!$A$2:$A$61=$A$1)*(BSRDetail!$F$2:$F$61=CP$1)*(BSRDetail!$B$2:$B$61=$B$1)*(BSRDetail!$E$2:$E$61>=$B6)*(BSRDetail!$E$2:$E$61<$B7))","v":0},{"$f":"CP6","v":0},{"$f":"SUM(BSRDetail!$H$2:$H$61*(BSRDetail!$A$2:$A$61=$A$1)*(BSRDetail!$F$2:$F$61=CR$1)*(BSRDetail!$B$2:$B$61=$B$1)*(BSRDetail!$E$2:$E$61>=$B6)*(BSRDetail!$E$2:$E$61<$B7))","v":0},{"$f":"CR6","v":0},{"$f":"SUM(BSRDetail!$H$2:$H$61*(BSRDetail!$A$2:$A$61=$A$1)*(BSRDetail!$F$2:$F$61=CT$1)*(BSRDetail!$B$2:$B$61=$B$1)*(BSRDetail!$E$2:$E$61>=$B6)*(BSRDetail!$E$2:$E$61<$B7))","v":0},{"$f":"CT6","v":0},{"$f":"SUM(BSRDetail!$H$2:$H$61*(BSRDetail!$A$2:$A$61=$A$1)*(BSRDetail!$F$2:$F$61=CV$1)*(BSRDetail!$B$2:$B$61=$B$1)*(BSRDetail!$E$2:$E$61>=$B6)*(BSRDetail!$E$2:$E$61<$B7))","v":0},{"$f":"CV6","v":0}]
{"$rows_left_out":48}
{"sheet":"Objects","index":3,"n_rows":1605,"n_cols":2,"rows_kept":1605,"cut":false,"hidden":false,"merged":[]}
["Object","Object Desciption"]
[5100,"SALARIES"]
[5120,"FURLOUGH ADJUSTMENTS"]
[5170,"SEASONAL"]
[5190,"SUPPLEMENTAL MILITARY PAY"]
[5200,"WORKERS COMPENSATION"]
{"$rows_left_out":1599}